Niedziałające wifi. Ubuntu 12.04


(Werakoral) #1

Cześć!

Mam ogromną prośbę, którą mam nadzieję spełni ktoś, kto się na tym zna, bo ja się nie znam.

W systemie Ubuntu 12.04 nie działa wifi. W ogóle ikonka bezprzewodowego Internetu nie pojawia się na panelu.

Wiem na pewno, że wifi jest, nawet około 6 różnych sieci bezprzewodowych - w tym miejscu, gdzie mieszkam.

Przekopałam się przez wiele forów i próbowałam wielu rozwiązań i żadne z nich nie działa.

Z tego, co zrozumiałam, aby ktoś mógł mi w ogóle pomóc, trzeba znać najpierw wyniki poleceń

ifconfig -a

lspci -k

Więc niniejszym je podaje:

x@x-HP-650-Notebook-PC:~$ ifconfig -a

eth0 Link encap:Ethernet HWaddr 38:ea:a7:fc:76:b0  

          inet addr:192.168.1.2 Bcast:192.168.1.255 Mask:255.255.255.0

          inet6 addr: fe80::3aea:a7ff:fefc:76b0/64 Scope:Link

          UP BROADCAST RUNNING MULTICAST MTU:1500 Metric:1

          RX packets:41461 errors:0 dropped:0 overruns:0 frame:0

          TX packets:33734 errors:0 dropped:0 overruns:0 carrier:0

          collisions:0 txqueuelen:1000 

          RX bytes:44348256 (44.3 MB) TX bytes:4934303 (4.9 MB)

          Interrupt:41 Base address:0x8000 


lo Link encap:Local Loopback  

          inet addr:127.0.0.1 Mask:255.0.0.0

          inet6 addr: ::1/128 Scope:Host

          UP LOOPBACK RUNNING MTU:16436 Metric:1

          RX packets:4142 errors:0 dropped:0 overruns:0 frame:0

          TX packets:4142 errors:0 dropped:0 overruns:0 carrier:0

          collisions:0 txqueuelen:0 

          RX bytes:601397 (601.3 KB) TX bytes:601397 (601.3 KB)

x@x-HP-650-Notebook-PC:~$ lspci -k

00:00.0 Host bridge: Intel Corporation 3rd Gen Core processor DRAM Controller (rev 09)

	Subsystem: Hewlett-Packard Company Device 1858

	Kernel driver in use: agpgart-intel

00:02.0 VGA compatible controller: Intel Corporation 3rd Gen Core processor Graphics Controller (rev 09)

	Subsystem: Hewlett-Packard Company Device 1858

	Kernel driver in use: i915

	Kernel modules: i915

00:16.0 Communication controller: Intel Corporation 7 Series/C210 Series Chipset Family MEI Controller #1 (rev 04)

	Subsystem: Hewlett-Packard Company Device 1858

	Kernel driver in use: mei

	Kernel modules: mei

00:1a.0 USB controller: Intel Corporation 7 Series/C210 Series Chipset Family USB Enhanced Host Controller #2 (rev 04)

	Subsystem: Hewlett-Packard Company Device 1858

	Kernel driver in use: ehci_hcd

00:1b.0 Audio device: Intel Corporation 7 Series/C210 Series Chipset Family High Definition Audio Controller (rev 04)

	Subsystem: Hewlett-Packard Company Device 1858

	Kernel driver in use: snd_hda_intel

	Kernel modules: snd-hda-intel

00:1c.0 PCI bridge: Intel Corporation 7 Series/C210 Series Chipset Family PCI Express Root Port 1 (rev c4)

	Kernel driver in use: pcieport

	Kernel modules: shpchp

00:1c.2 PCI bridge: Intel Corporation 7 Series/C210 Series Chipset Family PCI Express Root Port 3 (rev c4)

	Kernel driver in use: pcieport

	Kernel modules: shpchp

00:1c.3 PCI bridge: Intel Corporation 7 Series/C210 Series Chipset Family PCI Express Root Port 4 (rev c4)

	Kernel driver in use: pcieport

	Kernel modules: shpchp

00:1d.0 USB controller: Intel Corporation 7 Series/C210 Series Chipset Family USB Enhanced Host Controller #1 (rev 04)

	Subsystem: Hewlett-Packard Company Device 1858

	Kernel driver in use: ehci_hcd

00:1f.0 ISA bridge: Intel Corporation 7 Series Chipset Family LPC Controller (rev 04)

	Subsystem: Hewlett-Packard Company Device 1858

	Kernel modules: iTCO_wdt

00:1f.2 SATA controller: Intel Corporation 7 Series Chipset Family 6-port SATA Controller [AHCI mode] (rev 04)

	Subsystem: Hewlett-Packard Company Device 1858

	Kernel driver in use: ahci

00:1f.3 SMBus: Intel Corporation 7 Series/C210 Series Chipset Family SMBus Controller (rev 04)

	Subsystem: Hewlett-Packard Company Device 1858

	Kernel modules: i2c-i801

01:00.0 Ethernet controller: Realtek Semiconductor Co., Ltd. RTL8111/8168/8411 PCI Express Gigabit Ethernet Controller (rev 07)

	Subsystem: Hewlett-Packard Company Device 1858

	Kernel driver in use: r8169

	Kernel modules: r8169

02:00.0 Network controller: Ralink corp. RT3290 Wireless 802.11n 1T/1R PCIe

	Subsystem: Hewlett-Packard Company Device 18ec

02:00.1 Bluetooth: Ralink corp. RT3290 Bluetooth

	Subsystem: Hewlett-Packard Company Device 18ec

	Kernel driver in use: rtbt

	Kernel modules: rtbth

03:00.0 Unassigned class [ff00]: Realtek Semiconductor Co., Ltd. RTS5229 PCI Express Card Reader (rev 01)

	Subsystem: Hewlett-Packard Company Device 1858

	Kernel driver in use: rts5229

	Kernel modules: rts5229

Będę bardzo wdzięczna za wszystkie porady. Męczę się z tym już wiele godzin, a wydaje mi się, że rozwiązanie powinno być raczej proste... Tylko po prostu ja, nie znając się kompletnie na Ubuntu, nie mam pojęcia, jak je znaleźć. Pozdrawiam!:slight_smile:


(Posejdon81) #2

Pokaż jeszcze wynik:

uname -r

W normalnych Linuksach ta karta powinna od razu działać, no ale masz Ubuntu...


(Werakoral) #3
HP-650-Notebook-PC:~$ uname -r

3.2.0-55-generic

Podaję jeszcze inne wyniki, bo gdzieś na forum wyczytałam, że mogą być również przydatne w diagnozie: rfkill list all

\0: hp-wifi: Wireless LAN

	Soft blocked: no

	Hard blocked: no

1: hp-bluetooth: Bluetooth

	Soft blocked: no

	Hard blocked: no

2: hci0: Bluetooth

	Soft blocked: no

	Hard blocked: no

lspci -vvv

00:00.0 Host bridge: Intel Corporation 3rd Gen Core processor DRAM Controller (rev 09)

	Subsystem: Hewlett-Packard Company Device 1858

	Control: I/O- Mem+ BusMaster+ SpecCycle- MemWINV- VGASnoop- ParErr- Stepping- SERR- FastB2B- DisINTx-

	Status: Cap+ 66MHz- UDF- FastB2B+ ParErr- DEVSEL=fast >TAbort- SERR- 
	Latency: 0

	Capabilities: 

	Kernel driver in use: agpgart-intel


00:02.0 VGA compatible controller: Intel Corporation 3rd Gen Core processor Graphics Controller (rev 09) (prog-if 00 [VGA controller])

	Subsystem: Hewlett-Packard Company Device 1858

	Control: I/O+ Mem+ BusMaster+ SpecCycle- MemWINV- VGASnoop- ParErr- Stepping- SERR- FastB2B- DisINTx+

	Status: Cap+ 66MHz- UDF- FastB2B+ ParErr- DEVSEL=fast >TAbort- SERR- 
	Latency: 0

	Interrupt: pin A routed to IRQ 43

	Region 0: Memory at 52000000 (64-bit, non-prefetchable) [size=4M]

	Region 2: Memory at 40000000 (64-bit, prefetchable) [size=256M]

	Region 4: I/O ports at 4000 [size=64]

	Expansion ROM at [disabled]

	Capabilities: 

	Kernel driver in use: i915

	Kernel modules: i915


00:16.0 Communication controller: Intel Corporation 7 Series/C210 Series Chipset Family MEI Controller #1 (rev 04)

	Subsystem: Hewlett-Packard Company Device 1858

	Control: I/O- Mem+ BusMaster+ SpecCycle- MemWINV- VGASnoop- ParErr- Stepping- SERR- FastB2B- DisINTx+

	Status: Cap+ 66MHz- UDF- FastB2B- ParErr- DEVSEL=fast >TAbort- SERR- 
	Latency: 0

	Interrupt: pin A routed to IRQ 42

	Region 0: Memory at 52604000 (64-bit, non-prefetchable) [size=16]

	Capabilities: 

	Kernel driver in use: mei

	Kernel modules: mei


00:1a.0 USB controller: Intel Corporation 7 Series/C210 Series Chipset Family USB Enhanced Host Controller #2 (rev 04) (prog-if 20 [EHCI])

	Subsystem: Hewlett-Packard Company Device 1858

	Control: I/O- Mem+ BusMaster+ SpecCycle- MemWINV- VGASnoop- ParErr- Stepping- SERR- FastB2B- DisINTx-

	Status: Cap+ 66MHz- UDF- FastB2B+ ParErr- DEVSEL=medium >TAbort- SERR- 
	Latency: 0

	Interrupt: pin A routed to IRQ 16

	Region 0: Memory at 52609000 (32-bit, non-prefetchable) [size=1K]

	Capabilities: 

	Kernel driver in use: ehci_hcd


00:1b.0 Audio device: Intel Corporation 7 Series/C210 Series Chipset Family High Definition Audio Controller (rev 04)

	Subsystem: Hewlett-Packard Company Device 1858

	Control: I/O- Mem+ BusMaster+ SpecCycle- MemWINV- VGASnoop- ParErr- Stepping- SERR- FastB2B- DisINTx+

	Status: Cap+ 66MHz- UDF- FastB2B- ParErr- DEVSEL=fast >TAbort- SERR- 
	Latency: 0, Cache Line Size: 64 bytes

	Interrupt: pin A routed to IRQ 44

	Region 0: Memory at 52600000 (64-bit, non-prefetchable) [size=16K]

	Capabilities: 

	Kernel driver in use: snd_hda_intel

	Kernel modules: snd-hda-intel


00:1c.0 PCI bridge: Intel Corporation 7 Series/C210 Series Chipset Family PCI Express Root Port 1 (rev c4) (prog-if 00 [Normal decode])

	Control: I/O+ Mem+ BusMaster+ SpecCycle- MemWINV- VGASnoop- ParErr- Stepping- SERR- FastB2B- DisINTx-

	Status: Cap+ 66MHz- UDF- FastB2B- ParErr- DEVSEL=fast >TAbort- SERR- 
	Latency: 0, Cache Line Size: 64 bytes

	Bus: primary=00, secondary=01, subordinate=01, sec-latency=0

	I/O behind bridge: 00003000-00003fff

	Memory behind bridge: fff00000-000fffff

	Prefetchable memory behind bridge: 0000000052400000-00000000524fffff

	Secondary status: 66MHz- FastB2B- ParErr- DEVSEL=fast >TAbort- 
	BridgeCtl: Parity- SERR- NoISA- VGA- MAbort- >Reset- FastB2B-

		PriDiscTmr- SecDiscTmr- DiscTmrStat- DiscTmrSERREn-

	Capabilities: 

	Kernel driver in use: pcieport

	Kernel modules: shpchp


00:1c.2 PCI bridge: Intel Corporation 7 Series/C210 Series Chipset Family PCI Express Root Port 3 (rev c4) (prog-if 00 [Normal decode])

	Control: I/O+ Mem+ BusMaster+ SpecCycle- MemWINV- VGASnoop- ParErr- Stepping- SERR- FastB2B- DisINTx-

	Status: Cap+ 66MHz- UDF- FastB2B- ParErr- DEVSEL=fast >TAbort- SERR- 
	Latency: 0, Cache Line Size: 64 bytes

	Bus: primary=00, secondary=02, subordinate=02, sec-latency=0

	I/O behind bridge: 0000f000-00000fff

	Memory behind bridge: 52500000-525fffff

	Prefetchable memory behind bridge: 00000000fff00000-00000000000fffff

	Secondary status: 66MHz- FastB2B- ParErr- DEVSEL=fast >TAbort- 
	BridgeCtl: Parity- SERR- NoISA- VGA- MAbort- >Reset- FastB2B-

		PriDiscTmr- SecDiscTmr- DiscTmrStat- DiscTmrSERREn-

	Capabilities: 

	Kernel driver in use: pcieport

	Kernel modules: shpchp


00:1c.3 PCI bridge: Intel Corporation 7 Series/C210 Series Chipset Family PCI Express Root Port 4 (rev c4) (prog-if 00 [Normal decode])

	Control: I/O+ Mem+ BusMaster+ SpecCycle- MemWINV- VGASnoop- ParErr- Stepping- SERR- FastB2B- DisINTx-

	Status: Cap+ 66MHz- UDF- FastB2B- ParErr- DEVSEL=fast >TAbort- SERR- 
	Latency: 0, Cache Line Size: 64 bytes

	Bus: primary=00, secondary=03, subordinate=08, sec-latency=0

	I/O behind bridge: 00002000-00002fff

	Memory behind bridge: 51000000-51ffffff

	Prefetchable memory behind bridge: 0000000050000000-0000000050ffffff

	Secondary status: 66MHz- FastB2B- ParErr- DEVSEL=fast >TAbort- 
	BridgeCtl: Parity- SERR- NoISA- VGA- MAbort- >Reset- FastB2B-

		PriDiscTmr- SecDiscTmr- DiscTmrStat- DiscTmrSERREn-

	Capabilities: 

	Kernel driver in use: pcieport

	Kernel modules: shpchp


00:1d.0 USB controller: Intel Corporation 7 Series/C210 Series Chipset Family USB Enhanced Host Controller #1 (rev 04) (prog-if 20 [EHCI])

	Subsystem: Hewlett-Packard Company Device 1858

	Control: I/O- Mem+ BusMaster+ SpecCycle- MemWINV- VGASnoop- ParErr- Stepping- SERR- FastB2B- DisINTx-

	Status: Cap+ 66MHz- UDF- FastB2B+ ParErr- DEVSEL=medium >TAbort- SERR- 
	Latency: 0

	Interrupt: pin A routed to IRQ 23

	Region 0: Memory at 52608000 (32-bit, non-prefetchable) [size=1K]

	Capabilities: 

	Kernel driver in use: ehci_hcd


00:1f.0 ISA bridge: Intel Corporation 7 Series Chipset Family LPC Controller (rev 04)

	Subsystem: Hewlett-Packard Company Device 1858

	Control: I/O+ Mem+ BusMaster+ SpecCycle- MemWINV- VGASnoop- ParErr- Stepping- SERR- FastB2B- DisINTx-

	Status: Cap+ 66MHz- UDF- FastB2B- ParErr- DEVSEL=medium >TAbort- SERR- 
	Latency: 0

	Capabilities: 

	Kernel modules: iTCO_wdt


00:1f.2 SATA controller: Intel Corporation 7 Series Chipset Family 6-port SATA Controller [AHCI mode] (rev 04) (prog-if 01 [AHCI 1.0])

	Subsystem: Hewlett-Packard Company Device 1858

	Control: I/O+ Mem+ BusMaster+ SpecCycle- MemWINV- VGASnoop- ParErr- Stepping- SERR- FastB2B- DisINTx+

	Status: Cap+ 66MHz+ UDF- FastB2B+ ParErr- DEVSEL=medium >TAbort- SERR- 
	Latency: 0

	Interrupt: pin B routed to IRQ 40

	Region 0: I/O ports at 4088 [size=8]

	Region 1: I/O ports at 4094 [size=4]

	Region 2: I/O ports at 4080 [size=8]

	Region 3: I/O ports at 4090 [size=4]

	Region 4: I/O ports at 4060 [size=32]

	Region 5: Memory at 52607000 (32-bit, non-prefetchable) [size=2K]

	Capabilities: 

	Kernel driver in use: ahci


00:1f.3 SMBus: Intel Corporation 7 Series/C210 Series Chipset Family SMBus Controller (rev 04)

	Subsystem: Hewlett-Packard Company Device 1858

	Control: I/O+ Mem+ BusMaster- SpecCycle- MemWINV- VGASnoop- ParErr- Stepping- SERR- FastB2B- DisINTx-

	Status: Cap- 66MHz- UDF- FastB2B+ ParErr- DEVSEL=medium >TAbort- SERR- 
	Interrupt: pin C routed to IRQ 10

	Region 0: Memory at 52605000 (64-bit, non-prefetchable) [size=256]

	Region 4: I/O ports at 4040 [size=32]

	Kernel modules: i2c-i801


01:00.0 Ethernet controller: Realtek Semiconductor Co., Ltd. RTL8111/8168/8411 PCI Express Gigabit Ethernet Controller (rev 07)

	Subsystem: Hewlett-Packard Company Device 1858

	Control: I/O+ Mem+ BusMaster+ SpecCycle- MemWINV- VGASnoop- ParErr- Stepping- SERR- FastB2B- DisINTx+

	Status: Cap+ 66MHz- UDF- FastB2B- ParErr- DEVSEL=fast >TAbort- SERR- 
	Latency: 0, Cache Line Size: 64 bytes

	Interrupt: pin A routed to IRQ 41

	Region 0: I/O ports at 3000 [size=256]

	Region 2: Memory at 52404000 (64-bit, prefetchable) [size=4K]

	Region 4: Memory at 52400000 (64-bit, prefetchable) [size=16K]

	Capabilities: 

	Kernel driver in use: r8169

	Kernel modules: r8169


02:00.0 Network controller: Ralink corp. RT3290 Wireless 802.11n 1T/1R PCIe

	Subsystem: Hewlett-Packard Company Device 18ec

	Control: I/O+ Mem+ BusMaster+ SpecCycle- MemWINV- VGASnoop- ParErr- Stepping- SERR- FastB2B- DisINTx-

	Status: Cap+ 66MHz- UDF- FastB2B- ParErr- DEVSEL=fast >TAbort- SERR- 
	Latency: 0, Cache Line Size: 64 bytes

	Interrupt: pin A routed to IRQ 11

	Region 0: Memory at 52510000 (32-bit, non-prefetchable) [size=64K]

	Capabilities: 


02:00.1 Bluetooth: Ralink corp. RT3290 Bluetooth

	Subsystem: Hewlett-Packard Company Device 18ec

	Control: I/O+ Mem+ BusMaster+ SpecCycle- MemWINV- VGASnoop- ParErr- Stepping- SERR- FastB2B- DisINTx-

	Status: Cap+ 66MHz- UDF- FastB2B- ParErr- DEVSEL=fast >TAbort- SERR- 
	Latency: 0, Cache Line Size: 64 bytes

	Interrupt: pin A routed to IRQ 18

	Region 0: Memory at 52500000 (32-bit, non-prefetchable) [size=64K]

	Capabilities: 

	Kernel driver in use: rtbt

	Kernel modules: rtbth


03:00.0 Unassigned class [ff00]: Realtek Semiconductor Co., Ltd. RTS5229 PCI Express Card Reader (rev 01)

	Subsystem: Hewlett-Packard Company Device 1858

	Control: I/O+ Mem+ BusMaster+ SpecCycle- MemWINV- VGASnoop- ParErr- Stepping- SERR- FastB2B- DisINTx-

	Status: Cap+ 66MHz- UDF- FastB2B- ParErr- DEVSEL=fast >TAbort- SERR- 
	Latency: 0, Cache Line Size: 64 bytes

	Interrupt: pin A routed to IRQ 19

	Region 0: Memory at 51000000 (32-bit, non-prefetchable) [size=4K]

	Capabilities: 

	Kernel driver in use: rts5229

	Kernel modules: rts5229

(dragonn) #4

http://ubuntuforums.org/showthread.php?t=2104690 druga opcja to aktualizacja do nowszego ubuntu - w nowszym masz nowszy kernel który podobno już bez instalowania czegokolwiek obsługuje tą kartę.


(Werakoral) #5

Zaczęłam postępować zgodnie z instrukcjami z podanego linku, ale już po pierwszym poleceniu pojawiło się między innymi coś takiego:

Loading new oem-wireless-rt2x00-1044172-20120910compatwirelessstella6 DKMS files...

First Installation: checking all kernels...

Building only for 3.2.0-55-generic

Building for architecture x86_64

Building initial module for 3.2.0-55-generic

Error! Bad return status for module build on kernel: 3.2.0-55-generic (x86_64)

Consult /var/lib/dkms/oem-wireless-rt2x00-1044172/20120910compatwirelessstella6/build/make.log for more information.

dpkg: błąd przetwarzania oem-wireless-rt2x00-1044172-dkms (--configure):

 podproces zainstalowany skrypt post-installation zwrócił kod błędu 10

Wystąpiły błędy podczas przetwarzania:

 oem-wireless-rt2x00-1044172-dkms

E: Sub-process /usr/bin/dpkg returned an error code (1)

Czego dotyczy ten błąd i jak go można naprawić?


(marcin82) #6

Po którym pierwszym poleceniu?


(Werakoral) #7

Po poleceniu ,,sudo apt-get update && sudo apt-get install build-essential linux-headers-generic"

sudo apt-get update && sudo apt-get install build-essential linux-headers-generic

[sudo] password for x: 

Stary http://extras.ubuntu.com precise Release.gpg

Stary http://archive.ubuntu.com precise Release.gpg                            

Pobieranie:1 http://archive.ubuntu.com precise-updates Release.gpg [198 B]     

Stary http://extras.ubuntu.com precise Release                                 

Stary http://archive.ubuntu.com precise Release                                

Stary http://extras.ubuntu.com precise/main Sources                            

Pobieranie:2 http://archive.ubuntu.com precise-updates Release [49,6 kB]       

Stary http://extras.ubuntu.com precise/main amd64 Packages                     

Stary http://extras.ubuntu.com precise/main i386 Packages                      

Ign. http://extras.ubuntu.com precise/main TranslationIndex                   

Pobieranie:3 http://security.ubuntu.com precise-security Release.gpg [198 B]   

Stary http://archive.ubuntu.com precise/main Sources                           

Stary http://archive.ubuntu.com precise/multiverse Sources                     

Stary http://archive.ubuntu.com precise/universe Sources                       

Stary http://archive.ubuntu.com precise/main amd64 Packages                    

Stary http://archive.ubuntu.com precise/multiverse amd64 Packages              

Stary http://archive.ubuntu.com precise/universe amd64 Packages                

Stary http://archive.ubuntu.com precise/main i386 Packages                     

Stary http://archive.ubuntu.com precise/multiverse i386 Packages               

Stary http://archive.ubuntu.com precise/universe i386 Packages                 

Stary http://archive.ubuntu.com precise/main TranslationIndex                  

Pobieranie:4 http://security.ubuntu.com precise-security Release [49,6 kB]     

Stary http://archive.ubuntu.com precise/multiverse TranslationIndex            

Stary http://archive.ubuntu.com precise/universe TranslationIndex              

Pobieranie:5 http://archive.ubuntu.com precise-updates/main Sources [422 kB]   

Ign. http://extras.ubuntu.com precise/main Translation-pl_PL                  

Ign. http://extras.ubuntu.com precise/main Translation-pl                     

Ign. http://extras.ubuntu.com precise/main Translation-en                     

Pobieranie:6 http://archive.ubuntu.com precise-updates/multiverse Sources [8343 B]

Pobieranie:7 http://archive.ubuntu.com precise-updates/universe Sources [98,8 kB]

Pobieranie:8 http://archive.ubuntu.com precise-updates/main amd64 Packages [701 kB]

Pobieranie:9 http://security.ubuntu.com precise-security/main Sources [92,1 kB]

Pobieranie:10 http://archive.ubuntu.com precise-updates/multiverse amd64 Packages [13,9 kB]

Pobieranie:11 http://archive.ubuntu.com precise-updates/universe amd64 Packages [221 kB]

Pobieranie:12 http://archive.ubuntu.com precise-updates/main i386 Packages [722 kB]

Pobieranie:13 http://archive.ubuntu.com precise-updates/multiverse i386 Packages [14,0 kB]

Pobieranie:14 http://archive.ubuntu.com precise-updates/universe i386 Packages [225 kB]

Stary http://archive.ubuntu.com precise-updates/main TranslationIndex          

Stary http://archive.ubuntu.com precise-updates/multiverse TranslationIndex    

Stary http://archive.ubuntu.com precise-updates/universe TranslationIndex      

Stary http://archive.ubuntu.com precise/main Translation-pl                    

Stary http://archive.ubuntu.com precise/main Translation-en                    

Stary http://archive.ubuntu.com precise/multiverse Translation-pl              

Stary http://archive.ubuntu.com precise/multiverse Translation-en              

Stary http://archive.ubuntu.com precise/universe Translation-pl                

Stary http://archive.ubuntu.com precise/universe Translation-en                

Stary http://archive.ubuntu.com precise-updates/main Translation-pl            

Stary http://archive.ubuntu.com precise-updates/main Translation-en            

Stary http://archive.ubuntu.com precise-updates/multiverse Translation-pl      

Stary http://archive.ubuntu.com precise-updates/multiverse Translation-en      

Stary http://archive.ubuntu.com precise-updates/universe Translation-pl        

Stary http://archive.ubuntu.com precise-updates/universe Translation-en        

Pobieranie:15 http://security.ubuntu.com precise-security/multiverse Sources [1804 B]

Pobieranie:16 http://security.ubuntu.com precise-security/universe Sources [29,3 kB]

Pobieranie:17 http://security.ubuntu.com precise-security/main amd64 Packages [334 kB]

Pobieranie:18 http://security.ubuntu.com precise-security/multiverse amd64 Packages [2449 B]

Pobieranie:19 http://security.ubuntu.com precise-security/universe amd64 Packages [84,0 kB]

Pobieranie:20 http://security.ubuntu.com precise-security/main i386 Packages [353 kB]

Pobieranie:21 http://security.ubuntu.com precise-security/multiverse i386 Packages [2640 B]

Pobieranie:22 http://security.ubuntu.com precise-security/universe i386 Packages [87,7 kB]

Stary http://security.ubuntu.com precise-security/main TranslationIndex        

Stary http://security.ubuntu.com precise-security/multiverse TranslationIndex  

Stary http://security.ubuntu.com precise-security/universe TranslationIndex    

Stary http://security.ubuntu.com precise-security/main Translation-en          

Stary http://security.ubuntu.com precise-security/multiverse Translation-en    

Stary http://security.ubuntu.com precise-security/universe Translation-en      

Stary http://archive.canonical.com precise Release.gpg                         

Stary http://archive.canonical.com precise Release                             

Stary http://hp.archive.canonical.com precise-stella-osaka Release.gpg

Stary http://archive.canonical.com precise/partner Sources

Stary http://hp.archive.canonical.com precise-stella-osaka Release

Stary http://archive.canonical.com precise/partner amd64 Packages

Stary http://archive.canonical.com precise/partner i386 Packages

Ign. http://archive.canonical.com precise/partner TranslationIndex

Stary http://hp.archive.canonical.com precise-stella-osaka/public amd64 Packages

Stary http://hp.archive.canonical.com precise-stella-osaka/public i386 Packages

Ign. http://hp.archive.canonical.com precise-stella-osaka/public TranslationIndex

Ign. http://archive.canonical.com precise/partner Translation-pl_PL

Ign. http://archive.canonical.com precise/partner Translation-pl

Ign. http://archive.canonical.com precise/partner Translation-en

Ign. http://hp.archive.canonical.com precise-stella-osaka/public Translation-pl_PL

Ign. http://hp.archive.canonical.com precise-stella-osaka/public Translation-pl

Ign. http://hp.archive.canonical.com precise-stella-osaka/public Translation-en

Pobrano 3511 kB w 5s (625 kB/s)

Czytanie list pakietów... Gotowe

Czytanie list pakietów... Gotowe

Budowanie drzewa zależności       

Odczyt informacji o stanie... Gotowe

build-essential jest już w najnowszej wersji.

build-essential zaznaczony jako zainstalowany ręcznie.

linux-headers-generic jest już w najnowszej wersji.

Następujące pakiety zostały zainstalowane automatycznie i nie są już więcej wymagane:

  gir1.2-timezonemap-1.0 realpath libdmraid1.0.0.rc16 libdebconfclient0

  kpartx-boot gir1.2-json-1.0 libwebkitgtk-1.0-common kpartx python-webkit

  rdate libjavascriptcoregtk-1.0-0 libdebian-installer4 btrfs-tools apt-clone

  libwebkitgtk-1.0-0 archdetect-deb dmraid python-pyicu gir1.2-xkl-1.0

Aby je usunąć należy użyć "apt-get autoremove".

0 aktualizowanych, 0 nowo instalowanych, 0 usuwanych i 8 nieaktualizowanych.

1 nie w pełni zainstalowanych lub usuniętych.

Po tej operacji zostanie dodatkowo użyte 0 B miejsca na dysku.

Kontynuować [T/n]? t

Konfigurowanie oem-wireless-rt2x00-1044172-dkms (20120910compatwirelessstella6) ...

Removing old oem-wireless-rt2x00-1044172-20120910compatwirelessstella6 DKMS files...


------------------------------

Deleting module version: 20120910compatwirelessstella6

completely from the DKMS tree.

------------------------------

Done.

Loading new oem-wireless-rt2x00-1044172-20120910compatwirelessstella6 DKMS files...

First Installation: checking all kernels...

Building only for 3.2.0-55-generic

Building for architecture x86_64

Building initial module for 3.2.0-55-generic

Error! Bad return status for module build on kernel: 3.2.0-55-generic (x86_64)

Consult /var/lib/dkms/oem-wireless-rt2x00-1044172/20120910compatwirelessstella6/build/make.log for more information.

dpkg: błąd przetwarzania oem-wireless-rt2x00-1044172-dkms (--configure):

 podproces zainstalowany skrypt post-installation zwrócił kod błędu 10

Wystąpiły błędy podczas przetwarzania:

 oem-wireless-rt2x00-1044172-dkms

E: Sub-process /usr/bin/dpkg returned an error code (1)

(dragonn) #8

Wrzuć zawartość tego pliku na forum:

/var/lib/dkms/oem-wireless-rt2x00-1044172/20120910compatwirelessstella6/build/make.log

(Werakoral) #9

Wyświetla mi się jakiś ,,brak dostępu"...

A jestem zalogowana oczywiście jako administrator.

/var/lib/dkms/oem-wireless-rt2x00-1044172/20120910compatwirelessstella6/build/make.log

bash: /var/lib/dkms/oem-wireless-rt2x00-1044172/20120910compatwirelessstella6/build/make.log: Brak dostępu

(marcin82) #10

Trzeba wyświetlić ten plik, czyli najpierw go pokazać, a potem skopiować z konsoli:

cat /var/lib/dkms/oem-wireless-rt2x00-1044172/20120910compatwirelessstella6/build/make.log

#11

A może spróbuj wyświetlić zawartość tego pliku, bo w ten sposób co podałeś wyżej to nie wiem co chcesz uzyskać.


(Werakoral) #12

Pierwszy raz korzystam z Ubuntu i w ogóle z posługiwania się ,,terminalem", więc z góry przepraszam za moją niewiedzę.

Wpisałam do konsoli ,,cat /var/lib/dkms/oem-wireless-rt2x00-1044172/20120910compatwirelessstella6/build/make.log" wyświetliło się co następuje:

cat /var/lib/dkms/oem-wireless-rt2x00-1044172/20120910compatwirelessstella6/build/make.log

DKMS make.log for oem-wireless-rt2x00-1044172-20120910compatwirelessstella6 for kernel 3.2.0-55-generic (x86_64)

sob, 26 paź 2013, 10:56:56 CEST

./scripts/gen-compat-autoconf.sh /var/lib/dkms/oem-wireless-rt2x00-1044172/20120910compatwirelessstella6/build/.config /var/lib/dkms/oem-wireless-rt2x00-1044172/20120910compatwirelessstella6/build/config.mk > include/linux/compat_autoconf.h

make -C /lib/modules/3.2.0-55-generic/build M=/var/lib/dkms/oem-wireless-rt2x00-1044172/20120910compatwirelessstella6/build modules

make[1]: Wejście do katalogu `/usr/src/linux-headers-3.2.0-55-generic'

  CC [M] /var/lib/dkms/oem-wireless-rt2x00-1044172/20120910compatwirelessstella6/build/compat/main.o

  CC [M] /var/lib/dkms/oem-wireless-rt2x00-1044172/20120910compatwirelessstella6/build/drivers/misc/eeprom/eeprom_93cx6.o

  CC [M] /var/lib/dkms/oem-wireless-rt2x00-1044172/20120910compatwirelessstella6/build/net/mac80211/main.o

  CC [M] /var/lib/dkms/oem-wireless-rt2x00-1044172/20120910compatwirelessstella6/build/drivers/net/wireless/rt2x00/rt2x00dev.o

In file included from /var/lib/dkms/oem-wireless-rt2x00-1044172/20120910compatwirelessstella6/build/include/linux/compat-2.6.h:64:0,

                 from :0:

/var/lib/dkms/oem-wireless-rt2x00-1044172/20120910compatwirelessstella6/build/include/linux/compat-3.4.h:32:21: error: redefinition of ‘kmalloc_array’

include/linux/slab.h:243:21: note: previous definition of ‘kmalloc_array’ was here

In file included from /var/lib/dkms/oem-wireless-rt2x00-1044172/20120910compatwirelessstella6/build/include/linux/compat-2.6.h:64:0,

                 from :0:

/var/lib/dkms/oem-wireless-rt2x00-1044172/20120910compatwirelessstella6/build/include/linux/compat-3.4.h:32:21: error: redefinition of ‘kmalloc_array’

include/linux/slab.h:243:21: note: previous definition of ‘kmalloc_array’ was here

In file included from /var/lib/dkms/oem-wireless-rt2x00-1044172/20120910compatwirelessstella6/build/include/linux/compat-2.6.h:64:0,

                 from :0:

/var/lib/dkms/oem-wireless-rt2x00-1044172/20120910compatwirelessstella6/build/include/linux/compat-3.4.h:32:21: error: redefinition of ‘kmalloc_array’In file included from /var/lib/dkms/oem-wireless-rt2x00-1044172/20120910compatwirelessstella6/build/include/linux/compat-2.6.h:64:0,

                 from :0:

/var/lib/dkms/oem-wireless-rt2x00-1044172/20120910compatwirelessstella6/build/include/linux/compat-3.4.h:32:21: error: redefinition of ‘kmalloc_array’


include/linux/slab.h:243:21: note: previous definition of ‘kmalloc_array’ was hereinclude/linux/slab.h:243:21: note: previous definition of ‘kmalloc_array’ was here


make[3]: *** [/var/lib/dkms/oem-wireless-rt2x00-1044172/20120910compatwirelessstella6/build/drivers/misc/eeprom/eeprom_93cx6.o] Błąd 1

make[2]: *** [/var/lib/dkms/oem-wireless-rt2x00-1044172/20120910compatwirelessstella6/build/drivers/misc/eeprom] Błąd 2

make[2]: *** Oczekiwanie na niezakończone zadania....

make[3]: *** [/var/lib/dkms/oem-wireless-rt2x00-1044172/20120910compatwirelessstella6/build/compat/main.o] Błąd 1

make[2]: *** [/var/lib/dkms/oem-wireless-rt2x00-1044172/20120910compatwirelessstella6/build/compat] Błąd 2

  CC [M] /var/lib/dkms/oem-wireless-rt2x00-1044172/20120910compatwirelessstella6/build/net/mac80211/status.o

  CC [M] /var/lib/dkms/oem-wireless-rt2x00-1044172/20120910compatwirelessstella6/build/drivers/net/wireless/rt2x00/rt2x00mac.o

make[4]: *** [/var/lib/dkms/oem-wireless-rt2x00-1044172/20120910compatwirelessstella6/build/drivers/net/wireless/rt2x00/rt2x00dev.o] Błąd 1

make[4]: *** Oczekiwanie na niezakończone zadania....

  CC [M] /var/lib/dkms/oem-wireless-rt2x00-1044172/20120910compatwirelessstella6/build/net/mac80211/sta_info.o

make[3]: *** [/var/lib/dkms/oem-wireless-rt2x00-1044172/20120910compatwirelessstella6/build/net/mac80211/main.o] Błąd 1

make[3]: *** Oczekiwanie na niezakończone zadania....

In file included from /var/lib/dkms/oem-wireless-rt2x00-1044172/20120910compatwirelessstella6/build/include/linux/compat-2.6.h:64:0,

                 from :0:

/var/lib/dkms/oem-wireless-rt2x00-1044172/20120910compatwirelessstella6/build/include/linux/compat-3.4.h:32:21: error: redefinition of ‘kmalloc_array’

include/linux/slab.h:243:21: note: previous definition of ‘kmalloc_array’ was here

make[4]: *** [/var/lib/dkms/oem-wireless-rt2x00-1044172/20120910compatwirelessstella6/build/drivers/net/wireless/rt2x00/rt2x00mac.o] Błąd 1

make[3]: *** [/var/lib/dkms/oem-wireless-rt2x00-1044172/20120910compatwirelessstella6/build/drivers/net/wireless/rt2x00] Błąd 2

make[2]: *** [/var/lib/dkms/oem-wireless-rt2x00-1044172/20120910compatwirelessstella6/build/drivers/net/wireless] Błąd 2

In file included from /var/lib/dkms/oem-wireless-rt2x00-1044172/20120910compatwirelessstella6/build/include/linux/compat-2.6.h:64:0,

                 from :0:

/var/lib/dkms/oem-wireless-rt2x00-1044172/20120910compatwirelessstella6/build/include/linux/compat-3.4.h:32:21: error: redefinition of ‘kmalloc_array’

include/linux/slab.h:243:21: note: previous definition of ‘kmalloc_array’ was here

make[3]: *** [/var/lib/dkms/oem-wireless-rt2x00-1044172/20120910compatwirelessstella6/build/net/mac80211/status.o] Błąd 1

In file included from /var/lib/dkms/oem-wireless-rt2x00-1044172/20120910compatwirelessstella6/build/include/linux/compat-2.6.h:64:0,

                 from :0:

/var/lib/dkms/oem-wireless-rt2x00-1044172/20120910compatwirelessstella6/build/include/linux/compat-3.4.h:32:21: error: redefinition of ‘kmalloc_array’

include/linux/slab.h:243:21: note: previous definition of ‘kmalloc_array’ was here

make[3]: *** [/var/lib/dkms/oem-wireless-rt2x00-1044172/20120910compatwirelessstella6/build/net/mac80211/sta_info.o] Błąd 1

make[2]: *** [/var/lib/dkms/oem-wireless-rt2x00-1044172/20120910compatwirelessstella6/build/net/mac80211] Błąd 2

make[1]: *** [_module_/var/lib/dkms/oem-wireless-rt2x00-1044172/20120910compatwirelessstella6/build] Błąd 2

make[1]: Opuszczenie katalogu `/usr/src/linux-headers-3.2.0-55-generic'

make: *** [modules] Błąd 2

(Posejdon81) #13

@ dragonn:

Po co polecasz takie cuda osobie, która pisze:

@ werakoral:

Pokaż jeszcze:

apt-cache search linux-image |grep backports

(Werakoral) #14
cat apt-cache search linux-image |grep backports

cat: apt-cache: Nie ma takiego pliku ani katalogu

cat: search: Nie ma takiego pliku ani katalogu

cat: linux-image: Nie ma takiego pliku ani katalogu

(Posejdon81) #15

Tam nie ma żadnego cat.

Powinno w wynikach być coś takiego:

linux-image-generic-lts-raring

apt-get install linux-image-generic-lts-raring linux-headers-generic-lts-raring

I taki pakiet zainstaluj. Potem zrestartuj komputer.


(Werakoral) #16

Tak, ale po wpisaniu samego

apt-cache search linux-image |grep backports

i wciśnięciu ,,enter" nie dzieje się dokładnie nic. Nic się nie pojawia.


(Posejdon81) #17

Bo trochę inaczej się nazywają te pakiety.

Zainstaluj:

apt-get install linux-image-generic-lts-raring linux-headers-generic-lts-raring

I potem restart.


(Werakoral) #18

Wyświetla się coś takiego:

apt-get install linux-image-generic-lts-raring linux-headers-generic-lts-rarin

E: Nie udało się otworzyć pliku blokady /var/lib/dpkg/lock - open (13: Brak dostępu)

E: Nie udało się zablokować katalogu administracyjnego (/var/lib/dpkg/), czy użyto uprawnień administratora?

Nie rozumiem dlaczego, ponieważ jestem zalogowana jako administrator. Zresztą to moje konto, to jedyne konto na tym komputerze i jest napisane ,,typ konta:administrator".


(dragonn) #19

Miałem taką nadzieję że uda się to bardziej bezproblemowo... ale kolejny raz ubuntu pokazuje jakie jest user-friendly.

werakoral domyślnie żaden użytkownika na Linuksie nie ma uprawnienie administratora - żeby wywołać polecenie jako "administrator" czyli inaczej root trzeba dać przed nim sudo albo wklepać sudo su, wtedy konsola przejdzie w tryb root-a. Możesz spróbować tego co podał poseidon czyli:

sudo apt-get install linux-image-generic-lts-raring linux-headers-generic-lts-raring

Ale podejrzewam że dużo to nie da :P. Tak że lepiej będzie iść za radą werakoral i zainstalować nowszy kernel z backport. BTW Nie zniechęcaj się :stuck_out_tongue: , ostanio koleżance pomagałem opanować Debiana, miała tak samie problemy jak ty :smiley: .


(Werakoral) #20

Zastosowałam ,,sudo apt-get install linux-image-generic-lts-raring linux-headers-generic-lts-raring" i pokazało się coś takiego:

x@x-HP-650-Notebook-PC:~$ sudo apt-get install linux-image-generic-lts-raring linux-headers-generic-lts-raring

[sudo] password for x: 

Czytanie list pakietów... Gotowe

Budowanie drzewa zależności       

Odczyt informacji o stanie... Gotowe

Następujące pakiety zostały zainstalowane automatycznie i nie są już więcej wymagane:

  gir1.2-timezonemap-1.0 realpath libdmraid1.0.0.rc16 libdebconfclient0

  kpartx-boot gir1.2-json-1.0 libwebkitgtk-1.0-common kpartx python-webkit

  rdate libjavascriptcoregtk-1.0-0 libdebian-installer4 btrfs-tools apt-clone

  libwebkitgtk-1.0-0 archdetect-deb dmraid python-pyicu gir1.2-xkl-1.0

Aby je usunąć należy użyć "apt-get autoremove".

Zostaną zainstalowane następujące dodatkowe pakiety:

  linux-headers-3.8.0-32 linux-headers-3.8.0-32-generic

  linux-image-3.8.0-32-generic

Sugerowane pakiety:

  fdutils linux-lts-raring-doc-3.8.0 linux-lts-raring-source-3.8.0

  linux-lts-raring-tools

Zostaną zainstalowane następujące NOWE pakiety:

  linux-headers-3.8.0-32 linux-headers-3.8.0-32-generic

  linux-headers-generic-lts-raring linux-image-3.8.0-32-generic

  linux-image-generic-lts-raring

0 aktualizowanych, 5 nowo instalowanych, 0 usuwanych i 8 nieaktualizowanych.

1 nie w pełni zainstalowanych lub usuniętych.

Konieczne pobranie 61,2 MB archiwów.

Po tej operacji zostanie dodatkowo użyte 248 MB miejsca na dysku.

Kontynuować [T/n]? t

Pobieranie:1 http://archive.ubuntu.com/ubuntu/ precise-updates/main linux-image-3.8.0-32-generic amd64 3.8.0-32.47~precise1 [48,0 MB]

Pobieranie:2 http://archive.ubuntu.com/ubuntu/ precise-updates/main linux-headers-3.8.0-32 all 3.8.0-32.47~precise1 [12,2 MB]

Pobieranie:3 http://archive.ubuntu.com/ubuntu/ precise-updates/main linux-headers-3.8.0-32-generic amd64 3.8.0-32.47~precise1 [1015 kB]

Pobieranie:4 http://archive.ubuntu.com/ubuntu/ precise-updates/main linux-headers-generic-lts-raring amd64 3.8.0.32.32 [2384 B]

Pobieranie:5 http://archive.ubuntu.com/ubuntu/ precise-updates/main linux-image-generic-lts-raring amd64 3.8.0.32.32 [2394 B]

Pobrano 61,2 MB w 9s (6460 kB/s)                                               

Wybieranie wcześniej niewybranego pakietu linux-image-3.8.0-32-generic.

(Odczytywanie bazy danych ... 180327 plików i katalogów obecnie zainstalowanych.)

Rozpakowanie linux-image-3.8.0-32-generic (z .../linux-image-3.8.0-32-generic_3.8.0-32.47~precise1_amd64.deb) ...

Done.

Wybieranie wcześniej niewybranego pakietu linux-headers-3.8.0-32.

Rozpakowanie linux-headers-3.8.0-32 (z .../linux-headers-3.8.0-32_3.8.0-32.47~precise1_all.deb) ...

Wybieranie wcześniej niewybranego pakietu linux-headers-3.8.0-32-generic.

Rozpakowanie linux-headers-3.8.0-32-generic (z .../linux-headers-3.8.0-32-generic_3.8.0-32.47~precise1_amd64.deb) ...

Wybieranie wcześniej niewybranego pakietu linux-headers-generic-lts-raring.

Rozpakowanie linux-headers-generic-lts-raring (z .../linux-headers-generic-lts-raring_3.8.0.32.32_amd64.deb) ...

Wybieranie wcześniej niewybranego pakietu linux-image-generic-lts-raring.

Rozpakowanie linux-image-generic-lts-raring (z .../linux-image-generic-lts-raring_3.8.0.32.32_amd64.deb) ...

Konfigurowanie oem-wireless-rt2x00-1044172-dkms (20120910compatwirelessstella6) ...

Removing old oem-wireless-rt2x00-1044172-20120910compatwirelessstella6 DKMS files...


------------------------------

Deleting module version: 20120910compatwirelessstella6

completely from the DKMS tree.

------------------------------

Done.

Loading new oem-wireless-rt2x00-1044172-20120910compatwirelessstella6 DKMS files...

First Installation: checking all kernels...

Building for 3.2.0-55-generic and 3.8.0-32-generic

Building for architecture x86_64

Building initial module for 3.2.0-55-generic

Error! Bad return status for module build on kernel: 3.2.0-55-generic (x86_64)

Consult /var/lib/dkms/oem-wireless-rt2x00-1044172/20120910compatwirelessstella6/build/make.log for more information.

dpkg: błąd przetwarzania oem-wireless-rt2x00-1044172-dkms (--configure):

 podproces zainstalowany skrypt post-installation zwrócił kod błędu 10

Konfigurowanie linux-image-3.8.0-32-generic (3.8.0-32.47~precise1) ...

Running depmod.

update-initramfs: deferring update (hook will be called later)

Examining /etc/kernel/postinst.d.

run-parts: executing /etc/kernel/postinst.d/apt-auto-removal 3.8.0-32-generic /boot/vmlinuz-3.8.0-32-generic

run-parts: executing /etc/kernel/postinst.d/dkms 3.8.0-32-generic /boot/vmlinuz-3.8.0-32-generic

Error! Bad return status for module build on kernel: 3.8.0-32-generic (x86_64)

Consult /var/lib/dkms/rt3290bt/3.9.4stella3/build/make.log for more information.

Error! Bad return status for module build on kernel: 3.8.0-32-generic (x86_64)

Consult /var/lib/dkms/alsa-hda/0.201210081115~precise1/build/make.log for more information.

Error! Bad return status for module build on kernel: 3.8.0-32-generic (x86_64)

Consult /var/lib/dkms/rts5229/1.4stella2/build/make.log for more information.

Error! Problems with depmod detected. Automatically uninstalling this module.

DKMS: Install Failed (depmod problems). Module rolled back to built state.

Więc ciągle pokazują mi się błędy związane z tym kernelem (cokolwiek to jest...:wink:

"Error! Bad return status for module build on kernel"

Jak mam zainstalować nowy kernel i czy to znaczy, że będę mieć nowy system? Wszystkie ustawienia, dokumenty, znikną?

Dziękuję wszystkim za wyrozumiałość i pomoc;p